Reaction Details
TargetCannabinoid receptor 2
LigandBDBM50267671
Substrate/Competitorn/a
Meas. Tech.ChEMBL_563542 (CHEMBL961829)
Ki 120±n/a nM
Citation Brizzi, ABrizzi, VCascio, MGCorelli, FGuida, FLigresti, AMaione, SMartinelli, APasquini, STuccinardi, TDi Marzo, V New resorcinol-anandamide"hybrids" as potent cannabinoid receptor ligands endowed with antinociceptive activity in vivo. J Med Chem52:2506-14 (2009) 
 
Cannabinoid receptor 2
Name:Cannabinoid receptor 2
Type:G Protein-Coupled Receptor (GPCR)
Mol. Mass.:39690.94
Organism:Homo sapiens (Human)
Description:P34972
Residue:360
BDBM50267671
NameBDBM50267671
Synonyms:11-(3-butoxy-5-hydroxyphenoxy)-N-cyclopropylundecanamide | CHEMBL490245
TypeSmall organic molecule
Emp. Form.C24H39NO4
Mol. Mass.405.5708
SMILESCCCCOc1cc(O)cc(OCCCCCCCCCCC(=O)NC2CC2)c1