Reaction Details
TargetCannabinoid receptor 2
LigandBDBM50267755
Substrate/Competitorn/a
Meas. Tech.ChEMBL_563542 (CHEMBL961829)
Ki 600±n/a nM
Citation Brizzi, ABrizzi, VCascio, MGCorelli, FGuida, FLigresti, AMaione, SMartinelli, APasquini, STuccinardi, TDi Marzo, V New resorcinol-anandamide"hybrids" as potent cannabinoid receptor ligands endowed with antinociceptive activity in vivo. J Med Chem52:2506-14 (2009) 
 
Cannabinoid receptor 2
Name:Cannabinoid receptor 2
Type:G Protein-Coupled Receptor (GPCR)
Mol. Mass.:39690.94
Organism:Homo sapiens (Human)
Description:P34972
Residue:360
BDBM50267755
NameBDBM50267755
Synonyms:CHEMBL483670 | N-(cyclopropylmethyl)-12-(3-hydroxy-5-(2-methyloctan-2-yl)phenoxy)dodecanamide
TypeSmall organic molecule
Emp. Form.C31H53NO3
Mol. Mass.487.7574
SMILESCCCCCCC(C)(C)c1cc(O)cc(OCCCCCCCCCCCC(=O)NCC2CC2)c1