Reaction Details
TargetNociceptin receptor
LigandBDBM50259579
Substrate/Competitorn/a
Meas. Tech.ChEMBL_500498 (CHEMBL1009675)
Ki 71.0±n/a nM
Citation Yang, SWHo, GTulshian, DGreenlee, WJTan, ZZhang, HSmith-Torhan, AFawzi, AAnthes, JLu, SVarty, GFernandez, XMcLeod, RLHey, J Identification of 3-substituted N-benzhydryl-nortropane analogs as nociceptin receptor ligands for the management of cough and anxiety. Bioorg Med Chem Lett19:2482-6 (2009) 
 
Nociceptin receptor
Name:Nociceptin receptor
Type:G Protein-Coupled Receptor (GPCR)
Mol. Mass.:40702.87
Organism:Homo sapiens (Human)
Description:P41146
Residue:370
BDBM50259579
NameBDBM50259579
Synonyms:CHEMBL3084559 | endo-8-(bis(2-chlorophenyl)methyl)-3-(pyridin-3-yl)-8-azabicyclo[3.2.1]octane-3-carboxamide
TypeSmall organic molecule
Emp. Form.C26H25Cl2N3O
Mol. Mass.466.402
SMILES[H][C@]12CC[C@]([H])(C[C@](C1)(C(N)=O)c1cccnc1)N2C(c1ccccc1Cl)c1ccccc1Cl