Reaction Details
TargetMu-type opioid receptor
LigandBDBM50259398
Substrate/Competitorn/a
Meas. Tech.ChEMBL_500500 (CHEMBL1009677)
Ki 601±n/a nM
Citation Yang, SWHo, GTulshian, DGreenlee, WJTan, ZZhang, HSmith-Torhan, AFawzi, AAnthes, JLu, SVarty, GFernandez, XMcLeod, RLHey, J Identification of 3-substituted N-benzhydryl-nortropane analogs as nociceptin receptor ligands for the management of cough and anxiety. Bioorg Med Chem Lett19:2482-6 (2009) 
 
Mu-type opioid receptor
Name:Mu-type opioid receptor
Type:G Protein-Coupled Receptor (GPCR)
Mol. Mass.:44789.51
Organism:Homo sapiens (Human)
Description:P35372
Residue:400
BDBM50259398
NameBDBM50259398
Synonyms:CHEMBL3084550 | endo-N-(8-(bis(2-chlorophenyl)methyl)-3-(5-fluoropyridin-2-yl)-8-azabicyclo[3.2.1]octan-3-yl)acetamide
TypeSmall organic molecule
Emp. Form.C27H26Cl2FN3O
Mol. Mass.498.419
SMILES[H][C@]12CC[C@]([H])(C[C@](C1)(NC(C)=O)c1ccc(F)cn1)N2C(c1ccccc1Cl)c1ccccc1Cl