Reaction Details
TargetPeroxisome proliferator-activated receptor alpha
LigandBDBM50277819
Substrate/Competitorn/a
Meas. Tech.ChEMBL_502069 (CHEMBL983194)
IC50 175±n/a nM
Citation Bénardeau, ABenz, JBinggeli, ABlum, DBoehringer, MGrether, UHilpert, HKuhn, BMärki, HPMeyer, MPüntener, KRaab, SRuf, ASchlatter, DMohr, P Aleglitazar, a new, potent, and balanced dual PPARalpha/gamma agonist for the treatment of type II diabetes. Bioorg Med Chem Lett19:2468-73 (2009) 
 
Peroxisome proliferator-activated receptor alpha
Name:Peroxisome proliferator-activated receptor alpha
Type:Enzyme
Mol. Mass.:52222.08
Organism:Homo sapiens (Human)
Description:Q07869
Residue:468
BDBM50277819
NameBDBM50277819
Synonyms:3-(4-(2-(5-methyl-2-phenyloxazol-4-yl)ethoxy)benzo[b]thiophen-7-yl)-2-propoxypropanoic acid | CHEMBL521462
TypeSmall organic molecule
Emp. Form.C26H27NO5S
Mol. Mass.465.561
SMILESCCCOC(Cc1ccc(OCCc2nc(oc2C)-c2ccccc2)c2ccsc12)C(O)=O