Reaction Details
TargetPeroxisome proliferator-activated receptor alpha
LigandBDBM50277932
Substrate/Competitorn/a
Meas. Tech.ChEMBL_502069 (CHEMBL983194)
IC50 53±n/a nM
Citation Bénardeau, ABenz, JBinggeli, ABlum, DBoehringer, MGrether, UHilpert, HKuhn, BMärki, HPMeyer, MPüntener, KRaab, SRuf, ASchlatter, DMohr, P Aleglitazar, a new, potent, and balanced dual PPARalpha/gamma agonist for the treatment of type II diabetes. Bioorg Med Chem Lett19:2468-73 (2009) 
 
Peroxisome proliferator-activated receptor alpha
Name:Peroxisome proliferator-activated receptor alpha
Type:Enzyme
Mol. Mass.:52222.08
Organism:Homo sapiens (Human)
Description:Q07869
Residue:468
BDBM50277932
NameBDBM50277932
Synonyms:(S)-2-ethoxy-3-(4-(2-(5-methyl-2-phenyloxazol-4-yl)ethoxy)benzo[b]thiophen-7-yl)propanoic acid | CHEMBL484962
TypeSmall organic molecule
Emp. Form.C25H25NO5S
Mol. Mass.451.535
SMILESCCO[C@@H](Cc1ccc(OCCc2nc(oc2C)-c2ccccc2)c2ccsc12)C(O)=O