Reaction Details
TargetPeroxisome proliferator-activated receptor gamma
LigandBDBM50277931
Substrate/Competitorn/a
Meas. Tech.ChEMBL_502070 (CHEMBL983195)
IC50 3±n/a nM
Citation Bénardeau, ABenz, JBinggeli, ABlum, DBoehringer, MGrether, UHilpert, HKuhn, BMärki, HPMeyer, MPüntener, KRaab, SRuf, ASchlatter, DMohr, P Aleglitazar, a new, potent, and balanced dual PPARalpha/gamma agonist for the treatment of type II diabetes. Bioorg Med Chem Lett19:2468-73 (2009) 
 
Peroxisome proliferator-activated receptor gamma
Name:Peroxisome proliferator-activated receptor gamma
Type:Nuclear Receptor
Mol. Mass.:57613.46
Organism:Homo sapiens (Human)
Description:P37231
Residue:505
BDBM50277931
NameBDBM50277931
Synonyms:(S)-3-(4-(2-(2-(3,5-dimethoxyphenyl)-5-methyloxazol-4-yl)ethoxy)benzo[b]thiophen-7-yl)-2-methoxypropanoic acid | CHEMBL521007
TypeSmall organic molecule
Emp. Form.C26H27NO7S
Mol. Mass.497.56
SMILESCO[C@@H](Cc1ccc(OCCc2nc(oc2C)-c2cc(OC)cc(OC)c2)c2ccsc12)C(O)=O