Reaction Details
TargetPeroxisome proliferator-activated receptor gamma
LigandBDBM50277973
Substrate/Competitorn/a
Meas. Tech.ChEMBL_502070 (CHEMBL983195)
IC50 17±n/a nM
Citation Bénardeau, ABenz, JBinggeli, ABlum, DBoehringer, MGrether, UHilpert, HKuhn, BMärki, HPMeyer, MPüntener, KRaab, SRuf, ASchlatter, DMohr, P Aleglitazar, a new, potent, and balanced dual PPARalpha/gamma agonist for the treatment of type II diabetes. Bioorg Med Chem Lett19:2468-73 (2009) 
 
Peroxisome proliferator-activated receptor gamma
Name:Peroxisome proliferator-activated receptor gamma
Type:Nuclear Receptor
Mol. Mass.:57613.46
Organism:Homo sapiens (Human)
Description:P37231
Residue:505
BDBM50277973
NameBDBM50277973
Synonyms:(S)-2-ethoxy-3-(4-(2-(5-methyl-2-(4-(trifluoromethyl)phenyl)oxazol-4-yl)ethoxy)benzo[b]thiophen-7-yl)propanoic acid | CHEMBL484000
TypeSmall organic molecule
Emp. Form.C26H24F3NO5S
Mol. Mass.519.533
SMILESCCO[C@@H](Cc1ccc(OCCc2nc(oc2C)-c2ccc(cc2)C(F)(F)F)c2ccsc12)C(O)=O