Reaction Details
TargetPeroxisome proliferator-activated receptor gamma
LigandBDBM50278028
Substrate/Competitorn/a
Meas. Tech.ChEMBL_502070 (CHEMBL983195)
IC50 27±n/a nM
Citation Bénardeau, ABenz, JBinggeli, ABlum, DBoehringer, MGrether, UHilpert, HKuhn, BMärki, HPMeyer, MPüntener, KRaab, SRuf, ASchlatter, DMohr, P Aleglitazar, a new, potent, and balanced dual PPARalpha/gamma agonist for the treatment of type II diabetes. Bioorg Med Chem Lett19:2468-73 (2009) 
 
Peroxisome proliferator-activated receptor gamma
Name:Peroxisome proliferator-activated receptor gamma
Type:Nuclear Receptor
Mol. Mass.:57613.46
Organism:Homo sapiens (Human)
Description:P37231
Residue:505
BDBM50278028
NameBDBM50278028
Synonyms:(S)-2-ethoxy-3-(4-(2-(5-methyl-2-(4-(trifluoromethyl)phenyl)oxazol-4-yl)ethoxy)naphthalen-1-yl)propanoic acid | CHEMBL521170
TypeSmall organic molecule
Emp. Form.C28H26F3NO5
Mol. Mass.513.5049
SMILESCCO[C@@H](Cc1ccc(OCCc2nc(oc2C)-c2ccc(cc2)C(F)(F)F)c2ccccc12)C(O)=O