Reaction Details
TargetPeroxisome proliferator-activated receptor gamma
LigandBDBM50278029
Substrate/Competitorn/a
Meas. Tech.ChEMBL_502070 (CHEMBL983195)
IC50 8±n/a nM
Citation Bénardeau, ABenz, JBinggeli, ABlum, DBoehringer, MGrether, UHilpert, HKuhn, BMärki, HPMeyer, MPüntener, KRaab, SRuf, ASchlatter, DMohr, P Aleglitazar, a new, potent, and balanced dual PPARalpha/gamma agonist for the treatment of type II diabetes. Bioorg Med Chem Lett19:2468-73 (2009) 
 
Peroxisome proliferator-activated receptor gamma
Name:Peroxisome proliferator-activated receptor gamma
Type:Nuclear Receptor
Mol. Mass.:57613.46
Organism:Homo sapiens (Human)
Description:P37231
Residue:505
BDBM50278029
NameBDBM50278029
Synonyms:(S)-3-(4-(2-(2-(biphenyl-4-yl)-5-methyloxazol-4-yl)ethoxy)naphthalen-1-yl)-2-(2,2,2-trifluoroethoxy)propanoic acid | CHEMBL508299
TypeSmall organic molecule
Emp. Form.C33H28F3NO5
Mol. Mass.575.5743
SMILESCc1oc(nc1CCOc1ccc(C[C@H](OCC(F)(F)F)C(O)=O)c2ccccc12)-c1ccc(cc1)-c1ccccc1