Reaction Details
TargetPeroxisome proliferator-activated receptor alpha
LigandBDBM50277934
Substrate/Competitorn/a
Meas. Tech.ChEMBL_502071 (CHEMBL983196)
EC50 555±n/a nM
Citation Bénardeau, ABenz, JBinggeli, ABlum, DBoehringer, MGrether, UHilpert, HKuhn, BMärki, HPMeyer, MPüntener, KRaab, SRuf, ASchlatter, DMohr, P Aleglitazar, a new, potent, and balanced dual PPARalpha/gamma agonist for the treatment of type II diabetes. Bioorg Med Chem Lett19:2468-73 (2009) 
 
Peroxisome proliferator-activated receptor alpha
Name:Peroxisome proliferator-activated receptor alpha
Type:Enzyme
Mol. Mass.:52222.08
Organism:Homo sapiens (Human)
Description:Q07869
Residue:468
BDBM50277934
NameBDBM50277934
Synonyms:(S)-3-(4-(2-(5-methyl-2-phenyloxazol-4-yl)ethoxy)benzo[b]thiophen-7-yl)-2-(2,2,2-trifluoroethoxy)propanoic acid | CHEMBL484607
TypeSmall organic molecule
Emp. Form.C25H22F3NO5S
Mol. Mass.505.506
SMILESCc1oc(nc1CCOc1ccc(C[C@H](OCC(F)(F)F)C(O)=O)c2sccc12)-c1ccccc1