Reaction Details
TargetPeroxisome proliferator-activated receptor alpha
LigandBDBM28700
Substrate/Competitorn/a
Meas. Tech.ChEMBL_502071 (CHEMBL983196)
EC50 69000±n/a nM
Citation Bénardeau, ABenz, JBinggeli, ABlum, DBoehringer, MGrether, UHilpert, HKuhn, BMärki, HPMeyer, MPüntener, KRaab, SRuf, ASchlatter, DMohr, P Aleglitazar, a new, potent, and balanced dual PPARalpha/gamma agonist for the treatment of type II diabetes. Bioorg Med Chem Lett19:2468-73 (2009) 
 
Peroxisome proliferator-activated receptor alpha
Name:Peroxisome proliferator-activated receptor alpha
Type:Enzyme
Mol. Mass.:52222.08
Organism:Homo sapiens (Human)
Description:Q07869
Residue:468
BDBM28700
NameBDBM28700
Synonyms:2-(4-(4-Chlorobenzoyl)phenoxy)-2-methylpropionic acid CHEMBL981 FIBRICOR LF 153 procetofenic acid
TypeSmall organic molecule
Emp. Form.C17H15ClO4
Mol. Mass.318.752
SMILESCC(C)(Oc1ccc(cc1)C(=O)c1ccc(Cl)cc1)C(O)=O