Reaction Details
TargetPeroxisome proliferator-activated receptor gamma
LigandBDBM50277822
Substrate/Competitorn/a
Meas. Tech.ChEMBL_502072 (CHEMBL983197)
EC50 1615±n/a nM
Citation Bénardeau, ABenz, JBinggeli, ABlum, DBoehringer, MGrether, UHilpert, HKuhn, BMärki, HPMeyer, MPüntener, KRaab, SRuf, ASchlatter, DMohr, P Aleglitazar, a new, potent, and balanced dual PPARalpha/gamma agonist for the treatment of type II diabetes. Bioorg Med Chem Lett19:2468-73 (2009) 
 
Peroxisome proliferator-activated receptor gamma
Name:Peroxisome proliferator-activated receptor gamma
Type:Nuclear Receptor
Mol. Mass.:57613.46
Organism:Homo sapiens (Human)
Description:P37231
Residue:505
BDBM50277822
NameBDBM50277822
Synonyms:2-methoxy-3-(4-(2-(2-(2-methoxyphenyl)-5-methyloxazol-4-yl)ethoxy)benzo[b]thiophen-7-yl)propanoic acid | CHEMBL519802
TypeSmall organic molecule
Emp. Form.C25H25NO6S
Mol. Mass.467.534
SMILESCOC(Cc1ccc(OCCc2nc(oc2C)-c2ccccc2OC)c2ccsc12)C(O)=O