Reaction Details
TargetPeroxisome proliferator-activated receptor gamma
LigandBDBM50277975
Substrate/Competitorn/a
Meas. Tech.ChEMBL_502072 (CHEMBL983197)
EC50 431±n/a nM
Citation Bénardeau, ABenz, JBinggeli, ABlum, DBoehringer, MGrether, UHilpert, HKuhn, BMärki, HPMeyer, MPüntener, KRaab, SRuf, ASchlatter, DMohr, P Aleglitazar, a new, potent, and balanced dual PPARalpha/gamma agonist for the treatment of type II diabetes. Bioorg Med Chem Lett19:2468-73 (2009) 
 
Peroxisome proliferator-activated receptor gamma
Name:Peroxisome proliferator-activated receptor gamma
Type:Nuclear Receptor
Mol. Mass.:57613.46
Organism:Homo sapiens (Human)
Description:P37231
Residue:505
BDBM50277975
NameBDBM50277975
Synonyms:(S)-3-(4-(2-(2-(biphenyl-4-yl)-5-methyloxazol-4-yl)ethoxy)benzo[b]thiophen-7-yl)-2-ethoxypropanoic acid | CHEMBL485187
TypeSmall organic molecule
Emp. Form.C31H29NO5S
Mol. Mass.527.631
SMILESCCO[C@@H](Cc1ccc(OCCc2nc(oc2C)-c2ccc(cc2)-c2ccccc2)c2ccsc12)C(O)=O