Reaction Details
TargetCarbonic anhydrase 2
LigandBDBM50259370
Substrate/Competitorn/a
Meas. Tech.ChEMBL_498931 (CHEMBL975372)
IC50 94±n/a nM
Citation Kasimoğullari, RBülbül, MGünhan, HGüleryüz, H Effects of new 5-amino-1,3,4-thiadiazole-2-sulfonamide derivatives on human carbonic anhydrase isozymes. Bioorg Med Chem17:3295-301 (2009) 
 
Carbonic anhydrase 2
Name:Carbonic anhydrase 2
Type:Enzyme
Mol. Mass.:29250.71
Organism:Homo sapiens (Human)
Description:P00918
Residue:260
BDBM50259370
NameBDBM50259370
Synonyms:CHEMBL499578 | Diethyl-2-((3-(4-benzoyl-5-phenyl-3-(5-sulfamoyl-1,3,4-thiadiazol-2-ylcarbamoyl)-1H-pyrazol-1-yl)phenyl)diazenyl)malonate
TypeSmall organic molecule
Emp. Form.C32H28N8O8S2
Mol. Mass.716.744
SMILES[#6]-[#6]-[#8]-[#6](=O)-[#6](=[#7]/[#7]-c1cccc(c1)-n1nc(-[#6](=O)-[#7]-c2nnc(s2)S([#7])(=O)=O)c(-[#6](=O)-c2ccccc2)c1-c1ccccc1)\[#6](=O)-[#8]-[#6]-[#6]