Reaction Details
TargetCarbonic anhydrase 2
LigandBDBM50259368
Substrate/Competitorn/a
Meas. Tech.ChEMBL_498934 (CHEMBL976241)
Ki 200±n/a nM
Citation Kasimoğullari, RBülbül, MGünhan, HGüleryüz, H Effects of new 5-amino-1,3,4-thiadiazole-2-sulfonamide derivatives on human carbonic anhydrase isozymes. Bioorg Med Chem17:3295-301 (2009) 
 
Carbonic anhydrase 2
Name:Carbonic anhydrase 2
Type:Enzyme
Mol. Mass.:29250.71
Organism:Homo sapiens (Human)
Description:P00918
Residue:260
BDBM50259368
NameBDBM50259368
Synonyms:4-Benzoyl-1-(3-(2-(1,3-dioxo-1-phenylbutan-2-ylidene)hydrazinyl)phenyl)-5-phenyl-N-(5-sulfamoyl-1,3,4-thiadiazol-2-yl)-1H-pyrazole-3-carboxamide | CHEMBL444683
TypeSmall organic molecule
Emp. Form.C35H26N8O6S2
Mol. Mass.718.761
SMILESCC(=O)C(=NNc1cccc(c1)-n1nc(C(=O)Nc2nnc(s2)S(N)(=O)=O)c(C(=O)c2ccccc2)c1-c1ccccc1)C(=O)c1ccccc1