Reaction Details
TargetCarbonic anhydrase 2
LigandBDBM50259367
Substrate/Competitorn/a
Meas. Tech.ChEMBL_498931 (CHEMBL975372)
IC50 15±n/a nM
Citation Kasimoğullari, RBülbül, MGünhan, HGüleryüz, H Effects of new 5-amino-1,3,4-thiadiazole-2-sulfonamide derivatives on human carbonic anhydrase isozymes. Bioorg Med Chem17:3295-301 (2009) 
 
Carbonic anhydrase 2
Name:Carbonic anhydrase 2
Type:Enzyme
Mol. Mass.:29250.71
Organism:Homo sapiens (Human)
Description:P00918
Residue:260
BDBM50259367
NameBDBM50259367
Synonyms:CHEMBL513122 | Ethyl-1-(4-aminophenyl)-5-phenyl-3-(5-sulfamoyl-1,3,4-thiadiazole-2-ylcarbamoyl)-1H-pyrazole-4-carboxylate
TypeSmall organic molecule
Emp. Form.C21H19N7O5S2
Mol. Mass.513.549
SMILESCCOC(=O)c1c(nn(c1-c1ccccc1)-c1ccc(N)cc1)C(=O)Nc1nnc(s1)S(N)(=O)=O