Reaction Details
TargetCarbonic anhydrase 1
LigandBDBM50259323
Substrate/Competitorn/a
Meas. Tech.ChEMBL_498933 (CHEMBL976240)
Ki 2700±n/a nM
Citation Kasimoğullari, RBülbül, MGünhan, HGüleryüz, H Effects of new 5-amino-1,3,4-thiadiazole-2-sulfonamide derivatives on human carbonic anhydrase isozymes. Bioorg Med Chem17:3295-301 (2009) 
 
Carbonic anhydrase 1
Name:Carbonic anhydrase 1
Type:Enzyme
Mol. Mass.:28873.37
Organism:Homo sapiens (Human)
Description:P00915
Residue:261
BDBM50259323
NameBDBM50259323
Synonyms:1-(3-Aminophenyl)-4-benzoyl-5-phenyl-N-(5-sulfamoyl-1,3,4-thiadiazole-2-yl)-1H-pyrazole-3-carboxamide | CHEMBL513840
TypeSmall organic molecule
Emp. Form.C25H19N7O4S2
Mol. Mass.545.593
SMILESNc1cccc(c1)-n1nc(C(=O)Nc2nnc(s2)S(N)(=O)=O)c(C(=O)c2ccccc2)c1-c1ccccc1