Reaction Details
TargetCarbonic anhydrase 2
LigandBDBM50259473
Substrate/Competitorn/a
Meas. Tech.ChEMBL_498934 (CHEMBL976241)
Ki 210±n/a nM
Citation Kasimoğullari, RBülbül, MGünhan, HGüleryüz, H Effects of new 5-amino-1,3,4-thiadiazole-2-sulfonamide derivatives on human carbonic anhydrase isozymes. Bioorg Med Chem17:3295-301 (2009) 
 
Carbonic anhydrase 2
Name:Carbonic anhydrase 2
Type:Enzyme
Mol. Mass.:29250.71
Organism:Homo sapiens (Human)
Description:P00918
Residue:260
BDBM50259473
NameBDBM50259473
Synonyms:4-Benzoyl-1-(2-methyl-1-(2-oxopropyl)-1H-indol-4-yl)-5-phenyl-N-(5-sulfamoyl-1,3,4-thiadiazol-2-yl)-1H-pyrazole-3-carboxamide | CHEMBL443431
TypeSmall organic molecule
Emp. Form.C31H25N7O5S2
Mol. Mass.639.704
SMILESCC(=O)Cn1c(C)cc2c(cccc12)-n1nc(C(=O)Nc2nnc(s2)S(N)(=O)=O)c(C(=O)c2ccccc2)c1-c1ccccc1