Reaction Details
TargetBeta-2 adrenergic receptor
LigandBDBM50236181
Substrate/Competitorn/a
Meas. Tech.ChEMBL_497790 (CHEMBL1007086)
EC50>1000±n/a nM
Citation Hattori, KToda, SImanishi, MItou, SNakajima, YWashizuka, KAraki, THamashima, HTomishima, YSakurai, MMatsui, SImamura, EUeshima, KYamamoto, TYamamoto, NIshikawa, HNakano, KUnami, NHamada, KMatsumura, YTakamura, F Discovery of highly potent and selective biphenylacylsulfonamide-based beta3-adrenergic receptor agonists and evaluation of physical properties as potential overactive bladder therapies: part 5. J Med Chem52:3063-72 (2009) 
 
Beta-2 adrenergic receptor
Name:Beta-2 adrenergic receptor
Type:n/a
Mol. Mass.:46461.69
Organism:Homo sapiens (Human)
Description:P07550
Residue:413
BDBM50236181
NameBDBM50236181
Synonyms:(R)-4'-(2-(2-hydroxy-2-phenylethylamino)ethyl)-3-isobutylbiphenyl-4-carboxylic acid 4-(2-{[(2R)-2-hydroxy-2-phenylethyl]amino}ethyl)-10-isobutyl-4-biphenylcarboxylic acid | CHEMBL270026
TypeSmall organic molecule
Emp. Form.C27H31NO3
Mol. Mass.417.5399
SMILESCC(C)Cc1cc(ccc1C(O)=O)-c1ccc(CCNC[C@H](O)c2ccccc2)cc1