Reaction Details
TargetBeta-3 adrenergic receptor
LigandBDBM50277476
Substrate/Competitorn/a
Meas. Tech.ChEMBL_497791 (CHEMBL1007087)
EC50 3.1±n/a nM
Citation Hattori, KToda, SImanishi, MItou, SNakajima, YWashizuka, KAraki, THamashima, HTomishima, YSakurai, MMatsui, SImamura, EUeshima, KYamamoto, TYamamoto, NIshikawa, HNakano, KUnami, NHamada, KMatsumura, YTakamura, F Discovery of highly potent and selective biphenylacylsulfonamide-based beta3-adrenergic receptor agonists and evaluation of physical properties as potential overactive bladder therapies: part 5. J Med Chem52:3063-72 (2009) 
 
Beta-3 adrenergic receptor
Name:Beta-3 adrenergic receptor
Type:G Protein-Coupled Receptor (GPCR)
Mol. Mass.:43534.88
Organism:Homo sapiens (Human)
Description:n/a
Residue:408
BDBM50277476
NameBDBM50277476
Synonyms:4'-(2-{[(2R)-2-Hydroxy-2-phenylethyl]amino}ethyl)-3-isopropoxy-N-(methylsulfonyl)biphenyl-4-carboxamide Hydrochloride | CHEMBL515397
TypeSmall organic molecule
Emp. Form.C27H32N2O5S
Mol. Mass.496.618
SMILESCC(C)Oc1cc(ccc1C(=O)NS(C)(=O)=O)-c1ccc(CCNC[C@H](O)c2ccccc2)cc1