Reaction Details
TargetTyrosine-protein kinase Lck
LigandBDBM50413752
Substrate/Competitorn/a
Meas. Tech.ChEMBL_499406 (CHEMBL1015858)
IC50 750±n/a nM
Citation Rich, JOBudde, CLMcConeghey, LDCotterill, ICMozhaev, VVSingh, SBGoetz, MAZhao, AMichels, PCKhmelnitsky, YL Application of combinatorial biocatalysis for a unique ring expansion of dihydroxymethylzearalenone. Bioorg Med Chem Lett19:3059-62 (2009) 
 
Tyrosine-protein kinase Lck
Name:Tyrosine-protein kinase Lck
Type:n/a
Mol. Mass.:57987.83
Organism:Homo sapiens (Human)
Description:P06239
Residue:509
BDBM50413752
NameBDBM50413752
Synonyms:CHEMBL2012519 | L-783277
TypeSmall organic molecule
Emp. Form.C19H24O7
Mol. Mass.364.3897
SMILESCOc1cc(O)c2c(CCCC(=O)C(=O)C(O)CCC[C@H](C)OC2=O)c1