Reaction Details
TargetAdenosine receptor A2a
LigandBDBM50258706
Substrate/Competitorn/a
Meas. Tech.ChEMBL_499867 (CHEMBL976199)
Ki 132±n/a nM
Citation Fernández, FCaamaño, OIsabel Nieto, MLópez, CGarcía-Mera, XStefanachi, ANicolotti, OIsabel Loza, MBrea, JEsteve, CSegarra, VVidal, BCarotti, A 1,3-dialkyl-8-N-substituted benzyloxycarbonylamino-9-deazaxanthines as potent adenosine receptor ligands: Design, synthesis, structure-affinity and structure-selectivity relationships. Bioorg Med Chem17:3618-29 (2009) 
 
Adenosine receptor A2a
Name:Adenosine receptor A2a
Type:G Protein-Coupled Receptor (GPCR)
Mol. Mass.:44716.46
Organism:Homo sapiens (Human)
Description:P29274
Residue:412
BDBM50258706
NameBDBM50258706
Synonyms:CHEMBL513135 | [4-(2,3,4,5-Tetrahydro-1,3-dimethyl-2,4-dioxo-1H-pyrrolo[3,2-d]pyrimidin-6-yl)phenyl]methyl 4-phenylpiperazine-1-carboxylate
TypeSmall organic molecule
Emp. Form.C26H27N5O4
Mol. Mass.473.5237
SMILESCn1c2cc([nH]c2c(=O)n(C)c1=O)-c1ccc(COC(=O)N2CCN(CC2)c2ccccc2)cc1