Reaction Details
TargetAdenosine receptor A1
LigandBDBM50258621
Substrate/Competitorn/a
Meas. Tech.ChEMBL_499869 (CHEMBL976201)
Ki 17.8±n/a nM
Citation Fernández, FCaamaño, OIsabel Nieto, MLópez, CGarcía-Mera, XStefanachi, ANicolotti, OIsabel Loza, MBrea, JEsteve, CSegarra, VVidal, BCarotti, A 1,3-dialkyl-8-N-substituted benzyloxycarbonylamino-9-deazaxanthines as potent adenosine receptor ligands: Design, synthesis, structure-affinity and structure-selectivity relationships. Bioorg Med Chem17:3618-29 (2009) 
 
Adenosine receptor A1
Name:Adenosine receptor A1
Type:G Protein-Coupled Receptor (GPCR)
Mol. Mass.:36520.92
Organism:Homo sapiens (Human)
Description:P30542
Residue:326
BDBM50258621
NameBDBM50258621
Synonyms:CHEMBL469119 | [4-(2,3,4,5-Tetrahydro-1,3-dimethyl-2,4-dioxo-1H-pyrrolo[3,2-d]pyrimidin-6-yl)phenyl]methyl-4-fluorophenylcarbamate
TypeSmall organic molecule
Emp. Form.C22H19FN4O4
Mol. Mass.422.4091
SMILESCn1c2cc([nH]c2c(=O)n(C)c1=O)-c1ccc(COC(=O)Nc2ccc(F)cc2)cc1