Reaction Details
TargetAdenosine receptor A1
LigandBDBM50258709
Substrate/Competitorn/a
Meas. Tech.ChEMBL_499869 (CHEMBL976201)
Ki 20.4±n/a nM
Citation Fernández, FCaamaño, OIsabel Nieto, MLópez, CGarcía-Mera, XStefanachi, ANicolotti, OIsabel Loza, MBrea, JEsteve, CSegarra, VVidal, BCarotti, A 1,3-dialkyl-8-N-substituted benzyloxycarbonylamino-9-deazaxanthines as potent adenosine receptor ligands: Design, synthesis, structure-affinity and structure-selectivity relationships. Bioorg Med Chem17:3618-29 (2009) 
 
Adenosine receptor A1
Name:Adenosine receptor A1
Type:G Protein-Coupled Receptor (GPCR)
Mol. Mass.:36520.92
Organism:Homo sapiens (Human)
Description:P30542
Residue:326
BDBM50258709
NameBDBM50258709
Synonyms:CHEMBL466021 | [4-(2,3,4,5-Tetrahydro-2,4-dioxo-1,3-dipropyl-1H-pyrrolo[3,2-d]pyrimidin-6-yl)phenyl]methyl phenylcarbamate
TypeSmall organic molecule
Emp. Form.C26H28N4O4
Mol. Mass.460.5249
SMILESCCCn1c2cc([nH]c2c(=O)n(CCC)c1=O)-c1ccc(COC(=O)Nc2ccccc2)cc1