Reaction Details
TargetHistone deacetylase 1
LigandBDBM50258551
Substrate/Competitorn/a
Meas. Tech.ChEMBL_500771 (CHEMBL970550)
IC50 3±n/a nM
Citation Attenni, BOntoria, JMCruz, JCRowley, MSchultz-Fademrecht, CSteinkühler, CJones, P Histone deacetylase inhibitors with a primary amide zinc binding group display antitumor activity in xenograft model. Bioorg Med Chem Lett19:3081-4 (2009) 
 
Histone deacetylase 1
Name:Histone deacetylase 1
Type:Enzyme
Mol. Mass.:55090.27
Organism:Homo sapiens (Human)
Description:Q13547
Residue:482
BDBM50258551
NameBDBM50258551
Synonyms:(S)-N-hydroxy-7-(2-(5-methoxy-2-methyl-1H-indol-3-yl)acetamido)-7-(5-(naphthalen-2-yl)-1H-imidazol-2-yl)heptanamide | CHEMBL445506
TypeSmall organic molecule
Emp. Form.C32H35N5O4
Mol. Mass.553.6514
SMILESCOc1ccc2[nH]c(C)c(CC(=O)N[C@@H](CCCCCC(=O)NO)c3nc(c[nH]3)-c3ccc4ccccc4c3)c2c1