Reaction Details
TargetHistone deacetylase 1
LigandBDBM50258625
Substrate/Competitorn/a
Meas. Tech.ChEMBL_500771 (CHEMBL970550)
IC50 19±n/a nM
Citation Attenni, BOntoria, JMCruz, JCRowley, MSchultz-Fademrecht, CSteinkühler, CJones, P Histone deacetylase inhibitors with a primary amide zinc binding group display antitumor activity in xenograft model. Bioorg Med Chem Lett19:3081-4 (2009) 
 
Histone deacetylase 1
Name:Histone deacetylase 1
Type:Enzyme
Mol. Mass.:55090.27
Organism:Homo sapiens (Human)
Description:Q13547
Residue:482
BDBM50258625
NameBDBM50258625
Synonyms:(S)-7-(5-(naphthalen-2-yl)-1H-imidazol-2-yl)-7-(2-nitrophenylsulfonamido)heptanoic acid | CHEMBL466014
TypeSmall organic molecule
Emp. Form.C26H26N4O6S
Mol. Mass.522.573
SMILESOC(=O)CCCCC[C@H](NS(=O)(=O)c1ccccc1[N+]([O-])=O)c1nc(c[nH]1)-c1ccc2ccccc2c1