Reaction Details
TargetAlpha-1A adrenergic receptor
LigandBDBM50258559
Substrate/Competitorn/a
Meas. Tech.ChEMBL_500044 (CHEMBL970447)
EC50 0.4±n/a nM
Citation Roberts, LRFish, PVIan Storer, RWhitlock, GA 6,7-Dihydro-5H-pyrrolo[1,2-a] imidazoles as potent and selective alpha1A adrenoceptor partial agonists. Bioorg Med Chem Lett19:3113-7 (2009) 
 
Alpha-1A adrenergic receptor
Name:Alpha-1A adrenergic receptor
Type:Cell-surface receptors
Mol. Mass.:51511.67
Organism:Homo sapiens (Human)
Description:P35348
Residue:466
BDBM50258559
NameBDBM50258559
Synonyms:(S)-6-(2-(pyrimidin-5-yl)phenyl)-6,7-dihydro-5H-pyrrolo[1,2-a]imidazole | CHEMBL513691
TypeSmall organic molecule
Emp. Form.C16H14N4
Mol. Mass.262.3092
SMILESC1[C@H](Cn2ccnc12)c1ccccc1-c1cncnc1