Reaction Details
TargetAlpha-1D adrenergic receptor
LigandBDBM50258560
Substrate/Competitorn/a
Meas. Tech.ChEMBL_500048 (CHEMBL970451)
EC50 146±n/a nM
Citation Roberts, LRFish, PVIan Storer, RWhitlock, GA 6,7-Dihydro-5H-pyrrolo[1,2-a] imidazoles as potent and selective alpha1A adrenoceptor partial agonists. Bioorg Med Chem Lett19:3113-7 (2009) 
 
Alpha-1D adrenergic receptor
Name:Alpha-1D adrenergic receptor
Type:Enzyme Catalytic Domain
Mol. Mass.:60485.82
Organism:Homo sapiens (Human)
Description:adrenergic Alpha1D ADRA1D HUMAN::P25100
Residue:572
BDBM50258560
NameBDBM50258560
Synonyms:(S)-2-(2-(6,7-dihydro-5H-pyrrolo[1,2-a]imidazol-6-yl)phenyl)oxazole | CHEMBL448802
TypeSmall organic molecule
Emp. Form.C15H13N3O
Mol. Mass.251.2832
SMILESC1[C@H](Cn2ccnc12)c1ccccc1-c1ncco1