Reaction Details
TargetAlpha-1A adrenergic receptor
LigandBDBM50258562
Substrate/Competitorn/a
Meas. Tech.ChEMBL_500044 (CHEMBL970447)
EC50 3±n/a nM
Citation Roberts, LRFish, PVIan Storer, RWhitlock, GA 6,7-Dihydro-5H-pyrrolo[1,2-a] imidazoles as potent and selective alpha1A adrenoceptor partial agonists. Bioorg Med Chem Lett19:3113-7 (2009) 
 
Alpha-1A adrenergic receptor
Name:Alpha-1A adrenergic receptor
Type:Cell-surface receptors
Mol. Mass.:51511.67
Organism:Homo sapiens (Human)
Description:P35348
Residue:466
BDBM50258562
NameBDBM50258562
Synonyms:(S)-2-(2-(6,7-dihydro-5H-pyrrolo[1,2-a]imidazol-6-yl)phenyl)thiazole | CHEMBL468710
TypeSmall organic molecule
Emp. Form.C15H13N3S
Mol. Mass.267.349
SMILESC1[C@H](Cn2ccnc12)c1ccccc1-c1nccs1