Reaction Details
TargetAlpha-1A adrenergic receptor
LigandBDBM50258594
Substrate/Competitorn/a
Meas. Tech.ChEMBL_500044 (CHEMBL970447)
EC50 1±n/a nM
Citation Roberts, LRFish, PVIan Storer, RWhitlock, GA 6,7-Dihydro-5H-pyrrolo[1,2-a] imidazoles as potent and selective alpha1A adrenoceptor partial agonists. Bioorg Med Chem Lett19:3113-7 (2009) 
 
Alpha-1A adrenergic receptor
Name:Alpha-1A adrenergic receptor
Type:Cell-surface receptors
Mol. Mass.:51511.67
Organism:Homo sapiens (Human)
Description:P35348
Residue:466
BDBM50258594
NameBDBM50258594
Synonyms:6-(5-fluoro-2-(pyrimidin-5-yl)phenyl)-6,7-dihydro-5H-pyrrolo[1,2-a]imidazole | CHEMBL506744
TypeSmall organic molecule
Emp. Form.C16H13FN4
Mol. Mass.280.2996
SMILESFc1ccc(-c2cncnc2)c(c1)C1Cc2nccn2C1