Reaction Details
TargetAlpha-1A adrenergic receptor
LigandBDBM50258640
Substrate/Competitorn/a
Meas. Tech.ChEMBL_500044 (CHEMBL970447)
EC50 3±n/a nM
Citation Roberts, LRFish, PVIan Storer, RWhitlock, GA 6,7-Dihydro-5H-pyrrolo[1,2-a] imidazoles as potent and selective alpha1A adrenoceptor partial agonists. Bioorg Med Chem Lett19:3113-7 (2009) 
 
Alpha-1A adrenergic receptor
Name:Alpha-1A adrenergic receptor
Type:Cell-surface receptors
Mol. Mass.:51511.67
Organism:Homo sapiens (Human)
Description:P35348
Residue:466
BDBM50258640
NameBDBM50258640
Synonyms:2-(2-(6,7-dihydro-5H-pyrrolo[1,2-a]imidazol-6-yl)-4-fluorophenyl)oxazole | CHEMBL466634
TypeSmall organic molecule
Emp. Form.C15H12FN3O
Mol. Mass.269.2737
SMILESFc1ccc(-c2ncco2)c(c1)C1Cc2nccn2C1