Reaction Details
TargetAlpha-1A adrenergic receptor
LigandBDBM50258590
Substrate/Competitorn/a
Meas. Tech.ChEMBL_500044 (CHEMBL970447)
EC50 4±n/a nM
Citation Roberts, LRFish, PVIan Storer, RWhitlock, GA 6,7-Dihydro-5H-pyrrolo[1,2-a] imidazoles as potent and selective alpha1A adrenoceptor partial agonists. Bioorg Med Chem Lett19:3113-7 (2009) 
 
Alpha-1A adrenergic receptor
Name:Alpha-1A adrenergic receptor
Type:Cell-surface receptors
Mol. Mass.:51511.67
Organism:Homo sapiens (Human)
Description:P35348
Residue:466
BDBM50258590
NameBDBM50258590
Synonyms:(S)-N-(2'-(6,7-dihydro-5H-pyrrolo[1,2-a]imidazol-6-yl)biphenyl-3-yl)methanesulfonamide | CHEMBL513871
TypeSmall organic molecule
Emp. Form.C19H19N3O2S
Mol. Mass.353.438
SMILESCS(=O)(=O)Nc1cccc(c1)-c1ccccc1[C@@H]1Cc2nccn2C1