Reaction Details
TargetAlpha-1A adrenergic receptor
LigandBDBM50258563
Substrate/Competitorn/a
Meas. Tech.ChEMBL_500044 (CHEMBL970447)
EC50 1±n/a nM
Citation Roberts, LRFish, PVIan Storer, RWhitlock, GA 6,7-Dihydro-5H-pyrrolo[1,2-a] imidazoles as potent and selective alpha1A adrenoceptor partial agonists. Bioorg Med Chem Lett19:3113-7 (2009) 
 
Alpha-1A adrenergic receptor
Name:Alpha-1A adrenergic receptor
Type:Cell-surface receptors
Mol. Mass.:51511.67
Organism:Homo sapiens (Human)
Description:P35348
Residue:466
BDBM50258563
NameBDBM50258563
Synonyms:(S)-6-(2-(pyridin-3-yl)phenyl)-6,7-dihydro-5H-pyrrolo[1,2-a]imidazole | CHEMBL468711
TypeSmall organic molecule
Emp. Form.C17H15N3
Mol. Mass.261.3211
SMILESC1[C@H](Cn2ccnc12)c1ccccc1-c1cccnc1