Reaction Details
TargetCarbonic anhydrase 2
LigandBDBM50258299
Substrate/Competitorn/a
Meas. Tech.ChEMBL_519735 (CHEMBL938998)
Ki 0.88±n/a nM
Citation Güzel, OMaresca, AScozzafava, ASalman, ABalaban, ATSupuran, CT Discovery of low nanomolar and subnanomolar inhibitors of the mycobacterial beta-carbonic anhydrases Rv1284 and Rv3273. J Med Chem52:4063-7 (2009) 
 
Carbonic anhydrase 2
Name:Carbonic anhydrase 2
Type:Enzyme
Mol. Mass.:29250.71
Organism:Homo sapiens (Human)
Description:P00918
Residue:260
BDBM50258299
NameBDBM50258299
Synonyms:1-({[5-(Aminosulfonyl)-3-(2,3,4,5,6-pentafluorophenyl)-1H-indol-2-yl]carbonyl}amino)-2,4,6 trimethylpyridinium perchlorate CHEMBL501294
TypeSmall organic molecule
Emp. Form.C23H18F5N4O3S
Mol. Mass.525.47
SMILESCc1cc(C)[n+](NC(=O)c2[nH]c3ccc(cc3c2-c2c(F)c(F)c(F)c(F)c2F)S(N)(=O)=O)c(C)c1