Reaction Details
TargetCarbonic anhydrase 2
LigandBDBM50258716
Substrate/Competitorn/a
Meas. Tech.ChEMBL_519735 (CHEMBL938998)
Ki 3.6±n/a nM
Citation Güzel, OMaresca, AScozzafava, ASalman, ABalaban, ATSupuran, CT Discovery of low nanomolar and subnanomolar inhibitors of the mycobacterial beta-carbonic anhydrases Rv1284 and Rv3273. J Med Chem52:4063-7 (2009) 
 
Carbonic anhydrase 2
Name:Carbonic anhydrase 2
Type:Enzyme
Mol. Mass.:29250.71
Organism:Homo sapiens (Human)
Description:P00918
Residue:260
BDBM50258716
NameBDBM50258716
Synonyms:1-({[5-(Aminosulfonyl)-3-(4-bromophenyl)-1H-indol-2-yl]carbonyl}amino)-2,4,6 trimethylpyridinium perchlorate CHEMBL468946
TypeSmall organic molecule
Emp. Form.C24H25N4O3S
Mol. Mass.449.545
SMILESCc1ccc(cc1)-c1c([nH]c2ccc(cc12)S(N)(=O)=O)C(=O)N[n+]1c(C)cc(C)cc1C