Reaction Details
TargetCarbonic anhydrase
LigandBDBM50258716
Substrate/Competitorn/a
Meas. Tech.ChEMBL_519732 (CHEMBL938995)
Ki 68±n/a nM
Citation Güzel, OMaresca, AScozzafava, ASalman, ABalaban, ATSupuran, CT Discovery of low nanomolar and subnanomolar inhibitors of the mycobacterial beta-carbonic anhydrases Rv1284 and Rv3273. J Med Chem52:4063-7 (2009) 
 
Carbonic anhydrase
Name:Carbonic anhydrase
Synonyms:PROBABLE TRANSMEMBRANE CARBONIC ANHYDRASE (CARBONATE DEHYDRATASE) (CARBONIC DEHYDRATASE)
Type:PROTEIN
Mol. Mass.:80567.22
Organism:Mycobacterium tuberculosis
Description:ChEMBL_878775
Residue:764
BDBM50258716
NameBDBM50258716
TypeSmall organic molecule
Emp. Form.C24H25N4O3S
Mol. Mass.449.545
SMILESCc1ccc(cc1)-c1c([nH]c2ccc(cc12)S(N)(=O)=O)C(=O)N[n+]1c(C)cc(C)cc1C