Reaction Details
TargetCarbonic anhydrase 2
LigandBDBM50258587
Substrate/Competitorn/a
Meas. Tech.ChEMBL_519735 (CHEMBL938998)
Ki 8±n/a nM
Citation Güzel, OMaresca, AScozzafava, ASalman, ABalaban, ATSupuran, CT Discovery of low nanomolar and subnanomolar inhibitors of the mycobacterial beta-carbonic anhydrases Rv1284 and Rv3273. J Med Chem52:4063-7 (2009) 
 
Carbonic anhydrase 2
Name:Carbonic anhydrase 2
Type:Enzyme
Mol. Mass.:29250.71
Organism:Homo sapiens (Human)
Description:P00918
Residue:260
BDBM50258587
NameBDBM50258587
Synonyms:1-(([5-(Aminosulfonyl)-3-phenyl-1H-indol-2-yl]carbonyl)amino)-2,4,6-trimethylpyridinium Perchlorate CHEMBL466832
TypeSmall organic molecule
Emp. Form.C23H23N4O3S
Mol. Mass.435.518
SMILESCc1cc(C)[n+](NC(=O)c2[nH]c3ccc(cc3c2-c2ccccc2)S(N)(=O)=O)c(C)c1