Reaction Details
TargetMuscarinic acetylcholine receptor M5
LigandBDBM50258656
Substrate/Competitorn/a
Meas. Tech.ChEMBL_519781 (CHEMBL957811)
Ki 1610±n/a nM
Citation Bridges, TMMarlo, JENiswender, CMJones, CKJadhav, SBGentry, PRPlumley, HCWeaver, CDConn, PJLindsley, CW Discovery of the first highly M5-preferring muscarinic acetylcholine receptor ligand, an M5 positive allosteric modulator derived from a series of 5-trifluoromethoxy N-benzyl isatins. J Med Chem52:3445-8 (2009) 
 
Muscarinic acetylcholine receptor M5
Name:Muscarinic acetylcholine receptor M5
Type:PROTEIN
Mol. Mass.:60102.35
Organism:Homo sapiens (Human)
Description:ChEMBL_1517990
Residue:532
BDBM50258656
NameBDBM50258656
Synonyms:1-(4-methoxybenzyl)-5-(trifluoromethoxy)indoline-2,3-dione VU0238429 | cid_42633508
TypeSmall organic molecule
Emp. Form.C17H12F3NO4
Mol. Mass.351.2767
SMILESCOc1ccc(CN2C(=O)C(=O)c3cc(OC(F)(F)F)ccc23)cc1