Reaction Details
TargetHistone deacetylase 1
LigandBDBM50258577
Substrate/Competitorn/a
Meas. Tech.ChEMBL_522840 (CHEMBL1002508)
IC50 4±n/a nM
Citation Kinzel, OLlauger-Bufi, LPescatore, GRowley, MSchultz-Fademrecht, CMonteagudo, EFonsi, MGonzalez Paz, OFiore, FSteinkühler, CJones, P Discovery of a potent class I selective ketone histone deacetylase inhibitor with antitumor activity in vivo and optimized pharmacokinetic properties. J Med Chem52:3453-6 (2009) 
 
Histone deacetylase 1
Name:Histone deacetylase 1
Type:Enzyme
Mol. Mass.:55090.27
Organism:Homo sapiens (Human)
Description:Q13547
Residue:482
BDBM50258577
NameBDBM50258577
Synonyms:(S)-1-methyl-N-(7-oxo-1-(5-(quinolin-3-yl)-1H-imidazol-2-yl)octyl)piperidine-4-carboxamide | CHEMBL2448574
TypeSmall organic molecule
Emp. Form.C28H37N5O2
Mol. Mass.475.6257
SMILESCCC(=O)CCCCC[C@H](NC(=O)C1CCN(C)CC1)c1ncc([nH]1)-c1cnc2ccccc2c1