Reaction Details
TargetHistone deacetylase 1
LigandBDBM50258325
Substrate/Competitorn/a
Meas. Tech.ChEMBL_522840 (CHEMBL1002508)
IC50 30±n/a nM
Citation Kinzel, OLlauger-Bufi, LPescatore, GRowley, MSchultz-Fademrecht, CMonteagudo, EFonsi, MGonzalez Paz, OFiore, FSteinkühler, CJones, P Discovery of a potent class I selective ketone histone deacetylase inhibitor with antitumor activity in vivo and optimized pharmacokinetic properties. J Med Chem52:3453-6 (2009) 
 
Histone deacetylase 1
Name:Histone deacetylase 1
Type:Enzyme
Mol. Mass.:55090.27
Organism:Homo sapiens (Human)
Description:Q13547
Residue:482
BDBM50258325
NameBDBM50258325
Synonyms:(S)-N-(1-(5-(4-methoxyquinolin-2-yl)-1H-imidazol-2-yl)-7-oxooctyl)-1-methylpiperidine-4-carboxamide | CHEMBL2448567
TypeSmall organic molecule
Emp. Form.C29H39N5O3
Mol. Mass.505.6517
SMILESCCC(=O)CCCCC[C@H](NC(=O)C1CCN(C)CC1)c1ncc([nH]1)-c1cc(OC)c2ccccc2n1