Reaction Details
TargetHistone deacetylase 1
LigandBDBM50258368
Substrate/Competitorn/a
Meas. Tech.ChEMBL_522840 (CHEMBL1002508)
IC50 39±n/a nM
Citation Kinzel, OLlauger-Bufi, LPescatore, GRowley, MSchultz-Fademrecht, CMonteagudo, EFonsi, MGonzalez Paz, OFiore, FSteinkühler, CJones, P Discovery of a potent class I selective ketone histone deacetylase inhibitor with antitumor activity in vivo and optimized pharmacokinetic properties. J Med Chem52:3453-6 (2009) 
 
Histone deacetylase 1
Name:Histone deacetylase 1
Type:Enzyme
Mol. Mass.:55090.27
Organism:Homo sapiens (Human)
Description:Q13547
Residue:482
BDBM50258368
NameBDBM50258368
Synonyms:(S)-1-methyl-N-(7-oxo-1-(5-(quinoxalin-6-yl)-1H-imidazol-2-yl)octyl)azetidine-3-carboxamide | CHEMBL2448571
TypeSmall organic molecule
Emp. Form.C25H32N6O2
Mol. Mass.448.5606
SMILESCCC(=O)CCCCC[C@H](NC(=O)C1CN(C)C1)c1ncc([nH]1)-c1ccc2nccnc2c1