Reaction Details
TargetHistone deacetylase 6
LigandBDBM50258579
Substrate/Competitorn/a
Meas. Tech.ChEMBL_522849 (CHEMBL1002517)
IC50 5500±n/a nM
Citation Kinzel, OLlauger-Bufi, LPescatore, GRowley, MSchultz-Fademrecht, CMonteagudo, EFonsi, MGonzalez Paz, OFiore, FSteinkühler, CJones, P Discovery of a potent class I selective ketone histone deacetylase inhibitor with antitumor activity in vivo and optimized pharmacokinetic properties. J Med Chem52:3453-6 (2009) 
 
Histone deacetylase 6
Name:Histone deacetylase 6
Type:Chromatin regulator; hydrolase; repressor
Mol. Mass.:131381.51
Organism:Homo sapiens (Human)
Description:Q9UBN7
Residue:1215
BDBM50258579
NameBDBM50258579
Synonyms:(S)-N-(1-(5-(2-methoxyquinolin-3-yl)-1H-imidazol-2-yl)-7-oxooctyl)-1-methylazetidine-3-carboxamide | CHEMBL2448576
TypeSmall organic molecule
Emp. Form.C27H35N5O3
Mol. Mass.477.5985
SMILESCCC(=O)CCCCC[C@H](NC(=O)C1CN(C)C1)c1ncc([nH]1)-c1cc2ccccc2nc1OC