Reaction Details
TargetMetabotropic glutamate receptor 5
LigandBDBM50258612
Substrate/Competitorn/a
Meas. Tech.ChEMBL_523078 (CHEMBL1004108)
Ki 0.90±n/a nM
Citation Kulkarni, SSZou, MFCao, JDeschamps, JRRodriguez, ALConn, PJNewman, AH Structure-activity relationships comparing N-(6-methylpyridin-yl)-substituted aryl amides to 2-methyl-6-(substituted-arylethynyl)pyridines or 2-methyl-4-(substituted-arylethynyl)thiazoles as novel metabotropic glutamate receptor subtype 5 antagonists. J Med Chem52:3563-75 (2009) 
 
Metabotropic glutamate receptor 5
Name:Metabotropic glutamate receptor 5
Type:Enzyme
Mol. Mass.:132484.72
Organism:Homo sapiens (Human)
Description:n/a
Residue:1212
BDBM50258612
NameBDBM50258612
Synonyms:3-Fluoro-5-cyano-1-(2-methylthiazol-4-ylethynyl)benzene | CHEMBL446543
TypeSmall organic molecule
Emp. Form.C13H7FN2S
Mol. Mass.242.271
SMILESCc1nc(cs1)C#Cc1cc(F)cc(c1)C#N