Reaction Details
TargetMetabotropic glutamate receptor 5
LigandBDBM50258613
Substrate/Competitorn/a
Meas. Tech.ChEMBL_523078 (CHEMBL1004108)
Ki 11±n/a nM
Citation Kulkarni, SSZou, MFCao, JDeschamps, JRRodriguez, ALConn, PJNewman, AH Structure-activity relationships comparing N-(6-methylpyridin-yl)-substituted aryl amides to 2-methyl-6-(substituted-arylethynyl)pyridines or 2-methyl-4-(substituted-arylethynyl)thiazoles as novel metabotropic glutamate receptor subtype 5 antagonists. J Med Chem52:3563-75 (2009) 
 
Metabotropic glutamate receptor 5
Name:Metabotropic glutamate receptor 5
Type:Enzyme
Mol. Mass.:132484.72
Organism:Homo sapiens (Human)
Description:n/a
Residue:1212
BDBM50258613
NameBDBM50258613
Synonyms:1-(Pyridin-3-yl)-2-fluoro-4-(2-methylthiazol-4ylethynyl)benzene | CHEMBL443979
TypeSmall organic molecule
Emp. Form.C17H11FN2S
Mol. Mass.294.346
SMILESCc1nc(cs1)C#Cc1ccc(c(F)c1)-c1cccnc1