Reaction Details
TargetProtein kinase C theta type
LigandBDBM50258797
Substrate/Competitorn/a
Meas. Tech.ChEMBL_523117 (CHEMBL1007475)
IC50 27±n/a nM
Citation Boschelli, DHWang, DPrashad, ASSubrath, JWu, BNiu, CLee, JYang, XBrennan, AChaudhary, D Optimization of 5-phenyl-3-pyridinecarbonitriles as PKCtheta inhibitors. Bioorg Med Chem Lett19:3623-6 (2009) 
 
Protein kinase C theta type
Name:Protein kinase C theta type
Type:Serine/threonine-protein kinase
Mol. Mass.:81878.04
Organism:Homo sapiens (Human)
Description:Full-length human PKC theta (Panvera Catalog No. P2996).
Residue:706
BDBM50258797
NameBDBM50258797
Synonyms:4-(4-methyl-1H-indol-5-ylamino)-5-phenylnicotinonitrile | CHEMBL466653
TypeSmall organic molecule
Emp. Form.C21H16N4
Mol. Mass.324.3785
SMILESCc1c(Nc2c(cncc2-c2ccccc2)C#N)ccc2[nH]ccc12