Reaction Details
TargetProtein kinase C theta type
LigandBDBM50258822
Substrate/Competitorn/a
Meas. Tech.ChEMBL_523117 (CHEMBL1007475)
IC50 7.4±n/a nM
Citation Boschelli, DHWang, DPrashad, ASSubrath, JWu, BNiu, CLee, JYang, XBrennan, AChaudhary, D Optimization of 5-phenyl-3-pyridinecarbonitriles as PKCtheta inhibitors. Bioorg Med Chem Lett19:3623-6 (2009) 
 
Protein kinase C theta type
Name:Protein kinase C theta type
Type:Serine/threonine-protein kinase
Mol. Mass.:81878.04
Organism:Homo sapiens (Human)
Description:Full-length human PKC theta (Panvera Catalog No. P2996).
Residue:706
BDBM50258822
NameBDBM50258822
Synonyms:4-(4-methyl-1H-indol-5-ylamino)-5-(4-(2-(4-methylpiperazin-1-yl)ethoxy)phenyl)nicotinonitrile | CHEMBL467069
TypeSmall organic molecule
Emp. Form.C28H30N6O
Mol. Mass.466.5774
SMILESCN1CCN(CCOc2ccc(cc2)-c2cncc(C#N)c2Nc2ccc3[nH]ccc3c2C)CC1