Reaction Details
TargetProtein kinase C theta type
LigandBDBM50258389
Substrate/Competitorn/a
Meas. Tech.ChEMBL_523117 (CHEMBL1007475)
IC50 19±n/a nM
Citation Boschelli, DHWang, DPrashad, ASSubrath, JWu, BNiu, CLee, JYang, XBrennan, AChaudhary, D Optimization of 5-phenyl-3-pyridinecarbonitriles as PKCtheta inhibitors. Bioorg Med Chem Lett19:3623-6 (2009) 
 
Protein kinase C theta type
Name:Protein kinase C theta type
Type:Serine/threonine-protein kinase
Mol. Mass.:81878.04
Organism:Homo sapiens (Human)
Description:Full-length human PKC theta (Panvera Catalog No. P2996).
Residue:706
BDBM50258389
NameBDBM50258389
Synonyms:4-(4-methyl-1H-indol-5-ylamino)-5-(4-(3-(piperazin-1-ylmethylamino)propoxy)phenyl)nicotinonitrile | CHEMBL493825
TypeSmall organic molecule
Emp. Form.C29H32N6O
Mol. Mass.480.604
SMILESCN1CCN(CCCOc2ccc(cc2)-c2cncc(C#N)c2Nc2ccc3[nH]ccc3c2C)CC1