Reaction Details
TargetProtein kinase C delta type
LigandBDBM50258387
Substrate/Competitorn/a
Meas. Tech.ChEMBL_523118 (CHEMBL1007476)
IC50 280±n/a nM
Citation Boschelli, DHWang, DPrashad, ASSubrath, JWu, BNiu, CLee, JYang, XBrennan, AChaudhary, D Optimization of 5-phenyl-3-pyridinecarbonitriles as PKCtheta inhibitors. Bioorg Med Chem Lett19:3623-6 (2009) 
 
Protein kinase C delta type
Name:Protein kinase C delta type
Type:Enzyme
Mol. Mass.:77516.79
Organism:Homo sapiens (Human)
Description:The recombinant human PKC enzymes were produced using a baculovirus expression system in SF9 cells
Residue:676
BDBM50258387
NameBDBM50258387
Synonyms:5-(3,4-dimethoxyphenyl)-4-(6-methyl-1H-indol-5-ylamino)nicotinonitrile | CHEMBL494165
TypeSmall organic molecule
Emp. Form.C23H20N4O2
Mol. Mass.384.4305
SMILESCOc1ccc(cc1OC)-c1cncc(C#N)c1Nc1cc2cc[nH]c2cc1C