Reaction Details
TargetProtein kinase C delta type
LigandBDBM50258797
Substrate/Competitorn/a
Meas. Tech.ChEMBL_523118 (CHEMBL1007476)
IC50 63±n/a nM
Citation Boschelli, DHWang, DPrashad, ASSubrath, JWu, BNiu, CLee, JYang, XBrennan, AChaudhary, D Optimization of 5-phenyl-3-pyridinecarbonitriles as PKCtheta inhibitors. Bioorg Med Chem Lett19:3623-6 (2009) 
 
Protein kinase C delta type
Name:Protein kinase C delta type
Type:Enzyme
Mol. Mass.:77516.79
Organism:Homo sapiens (Human)
Description:The recombinant human PKC enzymes were produced using a baculovirus expression system in SF9 cells
Residue:676
BDBM50258797
NameBDBM50258797
Synonyms:4-(4-methyl-1H-indol-5-ylamino)-5-phenylnicotinonitrile | CHEMBL466653
TypeSmall organic molecule
Emp. Form.C21H16N4
Mol. Mass.324.3785
SMILESCc1c(Nc2c(cncc2-c2ccccc2)C#N)ccc2[nH]ccc12